r1 - 22 Aug 2008 - 13:23:04 - ChristofferBruunYou are here: OSAF >  Developers Web  >  ChandlerDesktopSource > DebianTestingBuildErrors
Error trace:

PREFIX=/home/cdbruun/src/chandler10/external/release DB_VER=4.6 VERSION=0.7-37 
        /home/cdbruun/src/chandler10/external/release/bin/python setup.py build --build-base=build_release  
                           install --force
running build
running build_py
running egg_info
writing chandlerdb.egg-info/PKG-INFO
writing top-level names to chandlerdb.egg-info/top_level.txt
writing dependency_links to chandlerdb.egg-info/dependency_links.txt
Traceback (most recent call last):
  File "setup.py", line 117, in <module>
    main()
  File "setup.py", line 114, in main
    exclude_package_data = {'': ['*.c', '*.h', '*.py']})
  File "/home/cdbruun/src/chandler10/external/release/lib/python2.5/distutils/core.py", line 151, in setup
    dist.run_commands()
  File "/home/cdbruun/src/chandler10/external/release/lib/python2.5/distutils/dist.py", line 974, in run_commands
    self.run_command(cmd)
  File "/home/cdbruun/src/chandler10/external/release/lib/python2.5/distutils/dist.py", line 994, in run_command
    cmd_obj.run()
  File "/home/cdbruun/src/chandler10/external/release/lib/python2.5/distutils/command/build.py", line 112, in run
    self.run_command(cmd_name)
  File "/home/cdbruun/src/chandler10/external/release/lib/python2.5/distutils/cmd.py", line 333, in run_command
    self.distribution.run_command(command)
  File "/home/cdbruun/src/chandler10/external/release/lib/python2.5/distutils/dist.py", line 994, in run_command
    cmd_obj.run()
  File "build_release/bdist.linux-x86_64/egg/setuptools/command/build_py.py", line 31, in run
  File "build_release/bdist.linux-x86_64/egg/setuptools/command/build_py.py", line 76, in build_package_data
  File "build_release/bdist.linux-x86_64/egg/setuptools/command/build_py.py", line 39, in __getattr__
  File "build_release/bdist.linux-x86_64/egg/setuptools/command/build_py.py", line 44, in _get_data_files
  File "build_release/bdist.linux-x86_64/egg/setuptools/command/build_py.py", line 92, in analyze_manifest
  File "/home/cdbruun/src/chandler10/external/release/lib/python2.5/distutils/cmd.py", line 333, in run_command
    self.distribution.run_command(command)
  File "/home/cdbruun/src/chandler10/external/release/lib/python2.5/distutils/dist.py", line 994, in run_command
    cmd_obj.run()
  File "build_release/bdist.linux-x86_64/egg/setuptools/command/egg_info.py", line 171, in run
  File "build_release/bdist.linux-x86_64/egg/setuptools/command/egg_info.py", line 252, in find_sources
  File "build_release/bdist.linux-x86_64/egg/setuptools/command/egg_info.py", line 306, in run
  File "build_release/bdist.linux-x86_64/egg/setuptools/command/egg_info.py", line 333, in add_defaults
  File "build_release/bdist.linux-x86_64/egg/setuptools/command/sdist.py", line 45, in walk_revctrl
  File "build_release/bdist.linux-x86_64/egg/setuptools/command/sdist.py", line 52, in _default_revctrl
  File "build_release/bdist.linux-x86_64/egg/setuptools/command/sdist.py", line 98, in entries_finder
NameError: global name 'log' is not defined
make[1]: *** [build] Fejl 1
make[1]: Forlader katalog '/home/cdbruun/src/chandler10/internal/chandlerdb'
make: *** [chandlerdb] Fejl 2
cdbruun@pluto:~/src/chandler10/internal$ uname -a
Linux pluto 2.6.25-2-amd64 #1 SMP Mon Jul 14 11:05:23 UTC 2008 x86_64 GNU/Linux
cdbruun@pluto:~/src/chandler10/internal$ 

-- ChristofferBruun - 22 Aug 2008

Edit | WYSIWYG | Attach | Printable | Raw View | Backlinks: Web, All Webs | History: r1 | More topic actions
 
Open Source Applications Foundation
Except where otherwise noted, this site and its content are licensed by OSAF under an Creative Commons License, Attribution Only 3.0.
See list of page contributors for attributions.